cannot compile on Arch Linux

Bug #746692 reported by Süleyman Balıkçı on 2011-03-31
6
This bug affects 1 person
Affects Status Importance Assigned to Milestone
nautilus-elementary
New
Undecided
Unassigned

Bug Description

I tried to install NE to Arch Lnux with gnome desktop. But I get this error:
nautilus-application.o: In function `screensaver_vanished_callback':
nautilus-application.c:(.text+0x74b): undefined reference to `g_list_free_full'
nautilus-application.o: In function `nautilus_application_finalize':
nautilus-application.c:(.text+0x1a59): undefined reference to `g_list_free_full'
collect2: ld returned 1 exit status
make[4]: *** [nautilus] Hata (error) 1
make[4]: `/home/thedeli/Desktop/nautilus-elementary-bzr/src/nautilus-elementary-build/src' dizininden çıkılıyor (quitting folder)
make[3]: *** [all-recursive] Hata 1
make[3]: `/home/thedeli/Desktop/nautilus-elementary-bzr/src/nautilus-elementary-build/src' dizininden çıkılıyor
make[2]: *** [all] Hata 2
make[2]: `/home/thedeli/Desktop/nautilus-elementary-bzr/src/nautilus-elementary-build/src' dizininden çıkılıyor
make[1]: *** [all-recursive] Hata 1
make[1]: `/home/thedeli/Desktop/nautilus-elementary-bzr/src/nautilus-elementary-build' dizininden çıkılıyor
make: *** [all] Hata 2

ammonkey (am-monkeyd) wrote :

archlinux don't have glib2.28?

if u don't want to upgrade glib then use this branch: https://code.launchpad.net/~am-monkeyd/nautilus-elementary/maverick

To post a comment you must log in.
This report contains Public information  Edit
Everyone can see this information.

Other bug subscribers