Comment 19 for bug 803982

Keith Murphy (bmurphy) wrote :

It appears that this is affecting Percona 5.5 builds now as well:

# rpm -qa | grep -i percon
Percona-Server-shared-compat-5.5.32-rel31.0.549.rhel6.x86_64
Percona-Server-shared-55-5.5.32-rel31.0.549.rhel6.x86_64
Percona-Server-server-55-5.5.32-rel31.0.549.rhel6.x86_64
percona-xtrabackup-2.1.3-608.rhel6.x86_64
Percona-Server-devel-55-5.5.32-rel31.0.549.rhel6.x86_64
Percona-Server-client-55-5.5.32-rel31.0.549.rhel6.x86_64
 #

 ~/mydumper-0.5.2] # make
Scanning dependencies of target mydumper
[ 20%] Building C object CMakeFiles/mydumper.dir/mydumper.c.o
[ 40%] Building C object CMakeFiles/mydumper.dir/binlog.c.o
[ 60%] Building C object CMakeFiles/mydumper.dir/server_detect.c.o
[ 80%] Building C object CMakeFiles/mydumper.dir/g_unix_signal.c.o
Linking C executable mydumper
CMakeFiles/mydumper.dir/binlog.c.o: In function `get_binlog_file':
/root/mydumper-0.5.2/binlog.c:160: undefined reference to `my_net_read'
collect2: ld returned 1 exit status
make[2]: *** [mydumper] Error 1
make[1]: *** [CMakeFiles/mydumper.dir/all] Error 2
make: *** [all] Error 2