libclang_rt.ubsan_osx.a clang: error: linker command failed

Bug #1284455 reported by Peter Zubkov
This bug affects 1 person
Affects Status Importance Assigned to Milestone

Bug Description

   * C Flags: -g -O2 -Wno-unknown-pragmas -Qunused-arguments -Wall -Wextra -std=c99 -Wno-attributes -Waddress -Wvarargs -Warray-bounds -Wbad-function-cast -Wchar-subscripts -Wcomment -Wfloat-equal -Wformat-security -Wformat=2 -Wformat-y2k -Wmissing-field-initializers -Wmissing-noreturn -Wmissing-prototypes -Wnested-externs -Wpointer-arith -Wpointer-sign -Wredundant-decls -Wshadow -Wshorten-64-to-32 -Wsign-compare -Wstrict-overflow=1 -Wstrict-prototypes -Wswitch-enum -Wundef -fsanitize=alignment -fsanitize=bool -fsanitize=bounds -fsanitize=enum -fsanitize=float-cast-overflow -fsanitize=float-divide-by-zero -fsanitize=integer-divide-by-zero -fsanitize=null -fsanitize=object-size -fsanitize=return -fsanitize=shift -fsanitize=signed-integer-overflow -fsanitize=unreachable -fsanitize=vla-bound -fsanitize=vptr -Wunused -Wunused-result -Wunused-variable -Wunused-parameter -Wwrite-strings -fwrapv -pipe
   * C++ Compiler: Apple LLVM version 5.1 (clang-503.0.19) (based on LLVM 3.4svn)
   * C++ Flags: -g -O2 -Wno-unknown-pragmas -Qunused-arguments -Wall -Wextra -Wno-attributes -Wvarargs -Waddress -Warray-bounds -Wchar-subscripts -Wcomment -Wctor-dtor-privacy -Wfloat-equal -Wformat=2 -Wformat-y2k -Wmissing-field-initializers -Wnon-virtual-dtor -Woverloaded-virtual -Wpointer-arith -Wredundant-decls -Wshadow -Wshorten-64-to-32 -Wsign-compare -Wstrict-overflow=1 -Wswitch-enum -Wundef -Wc++11-compat -fsanitize=alignment -fsanitize=bool -fsanitize=bounds -fsanitize=enum -fsanitize=float-cast-overflow -fsanitize=float-divide-by-zero -fsanitize=integer-divide-by-zero -fsanitize=null -fsanitize=object-size -fsanitize=return -fsanitize=shift -fsanitize=signed-integer-overflow -fsanitize=unreachable -fsanitize=vla-bound -fsanitize=vptr -Wunused -Wunused-result -Wunused-variable -Wunused-parameter -Wwrite-strings -Wformat-security -fwrapv -pipe
   * CPP Flags: -fvisibility=hidden
   * LIB Flags:
   * Assertions enabled: no
   * Debug enabled: no
   * Shared: yes
   * Warnings as failure: no
   * SASL support: yes
   * make -j: 5
   * VCS checkout: no

==> make install
/Applications/ -j5 install-am
make[1]: warning: -jN forced in submake: disabling jobserver mode.
  CXX libhashkit/libmemcached_libmemcached_la-aes.lo
  CXX libhashkit/libmemcached_libmemcached_la-algorithm.lo
  CXX libhashkit/libmemcached_libmemcached_la-behavior.lo
  CXX libhashkit/libmemcached_libmemcached_la-crc32.lo
  CXX libhashkit/libmemcached_libmemcached_la-digest.lo
  CXX libha
ld: file not found: /Applications/
clang: error: linker command failed with exit code 1 (use -v to see invocation)
make[1]: *** [libtest/abort] Error 1
make[1]: *** Waiting for unfinished jobs....
make: *** [install] Error 2

To post a comment you must log in.
This report contains Public information  
Everyone can see this information.

Other bug subscribers

Remote bug watches

Bug watches keep track of this bug in other bug trackers.