libmemcached-1.0.17 fails tests

Bug #1278023 reported by Matthew Thode on 2014-02-09
6
This bug affects 1 person
Affects Status Importance Assigned to Milestone
libmemcached
Undecided
Unassigned
Gentoo Linux
Unknown
Medium

Bug Description

=========================================
3 of 39 tests failed
(2 tests were not run)
Please report to http://libmemcached.org/
=========================================

FAIL: tests/memslap
FAIL: tests/testhashkit
FAIL: tests/libmemcached-1.0/testapp

The build and logs are available here.
http://dev.gentoo.org/~prometheanfire/bugs/430126/libmemcached-1.0.17.tar.gz
you should look in the temp folder for the build log

Download full text (6.8 KiB)

Collection: allocation
        Testing init 0.0[ ok ]
        Testing create and free 0.0[ ok ]
        Testing clone 0.0[ ok ]

Collection: hashkit_st_functions
        Testing hashkit_digest 0.0[ ok ]

tests/hashkit_functions.cc:334: in hashkit_set_function_test() Expected "0" got "4" Additionally: "INVALID ARGUMENT"
        Testing hashkit_set_function [ failed ]
        Testing hashkit_set_custom_function 0.0[ ok ]
        Testing hashkit_get_function 0.0[ ok ]
        Testing hashkit_set_distribution_function 0.0[ ok ]
        Testing hashkit_set_custom_distribution_function 0.0[ ok ]
        Testing hashkit_compare 0.0[ ok ]

Collection: library_functions
        Testing libhashkit_digest 0.0[ ok ]

Collection: hashing
        Testing one_at_a_time 0.0[ ok ]
        Testing md5 0.0[ ok ]
        Testing crc 0.0[ ok ]
        Testing fnv1_64 0.0[ ok ]
        Testing fnv1a_64 0.0[ ok ]
        Testing fnv1_32 0.0[ ok ]
        Testing fnv1a_32 0.0[ ok ]
        Testing hsieh 0.0[ ok ]
        Testing murmur 0.0[ ok ]
        Testing jenkis 0.0[ ok ]

Collection: regression

Some test failed.
        Total Collections 5
        Failed Collections 1
        Skipped Collections 0
        Succeeded Collections 4

Total 21
        Failed 1
        Skipped 0
        Succeeded 20

FAIL: tests/testhashkit

[snip]

=========================================
1 of 25 tests failed
Please report to http://libmemcached.org/
=========================================
make[2]: *** [check-TESTS] Error 1
make[2]: Leaving directory `/var/tmp/portage/dev-libs/libmemcached-1.0.4/work/libmemcached-1.0.4'
make[1]: *** [check-am] Error 2
make[1]: Leaving directory `/var/tmp/portage/dev-libs/libmemcached-1.0.4/work/libmemcached-1.0.4'
make: *** [check] Error 2
 * ERROR: dev-libs/libmemcached-1.0.4 failed (test phase):
 * Make check failed. See above for details.

Portage 2.1.11.9 (default/linux/amd64/10.0, gcc-4.7.1, glibc-2.15-r2, 3.5.0vs2.3.4-vs2.3.4 x86_64)
=================================================================
System uname: Linux-3.5.0vs2.3.4-vs2.3.4-x86_64-AMD_Phenom-tm-_II_X4_965_Processor-with-gentoo-2.1
Timestamp of tree: Unknown
app-shells/bash: 4.2_p37
dev-lang/python: 2.7.3-r2, 3.2.3-r1
dev-util/cmake: ...

Read more...

Does this still apply to 1.0.17-r1?

no longer affects: gentoo
Changed in gentoo:
importance: Unknown → Medium

doesn't apply against latest, closing.

sorry wrong memcache...

To post a comment you must log in.
This report contains Public information  Edit
Everyone can see this information.

Other bug subscribers

Remote bug watches

Bug watches keep track of this bug in other bug trackers.