libmemcached 1.0.14 with DTRACE

Bug #1079996 reported by Remi Collet on 2012-11-17
6
This bug affects 1 person
Affects Status Importance Assigned to Milestone
libmemcached
Medium
Brian Aker

Bug Description

When trying to build with --enable-dtrace
  CXXLD tests/libmemcached-1.0/testapp
libmemcachedinternal/.libs/libmemcachedinternal.a(libmemcachedinternal_libmemcachedinternal_la-connect.o):(.note.stapsdt+0x24): undefined reference to `libmemcached_memcached_connect_start_semaphore'
libmemcachedinternal/.libs/libmemcachedinternal.a(libmemcachedinternal_libmemcachedinternal_la-connect.o):(.note.stapsdt+0x78): undefined reference to `libmemcached_memcached_connect_end_semaphore'
collect2: error: ld returned 1 exit status
make[1]: *** [tests/libmemcached-1.0/internals] Error 1
make[1]: *** Waiting for unfinished jobs....
  CXXLD tests/libmemcached-1.0/testsocket
make[1]: Leaving directory `/dev/shm/extras/BUILD/libmemcached-1.0.14'
make: *** [all] Error 2
erreur: Mauvais status de sortie pour /var/tmp/rpm-tmp.l6C2oL (%build)

Related branches

Brian Aker (brianaker) on 2012-11-19
Changed in libmemcached:
milestone: none → 1.0.15
assignee: nobody → Brian Aker (brianaker)
importance: Undecided → Medium
status: New → In Progress
Brian Aker (brianaker) on 2012-11-20
Changed in libmemcached:
status: In Progress → Fix Committed
Brian Aker (brianaker) on 2012-12-23
Changed in libmemcached:
status: Fix Committed → Fix Released
To post a comment you must log in.
This report contains Public information  Edit
Everyone can see this information.

Other bug subscribers