make check-TESTS fails beause of missing session.conf.in

Bug #587811 reported by Evgeni Golov
6
This bug affects 1 person
Affects Status Importance Assigned to Milestone
libindicator
Fix Released
Undecided
Ted Gould

Bug Description

I'm currently trying to bring libindicator to Debian, however, build fails for me (if I do not disable tests), because session.conf.in is missing from the tarball (it's in bzr though):

make check-TESTS
make[3]: Entering directory `/tmp/buildd/libindicator-0.3.8/tests'
make[3]: *** No rule to make target `session.conf.in', needed by `session.conf'. Stop.
make[3]: Leaving directory `/tmp/buildd/libindicator-0.3.8/tests'
make[2]: *** [check-am] Error 2
make[2]: Leaving directory `/tmp/buildd/libindicator-0.3.8/tests'
make[1]: *** [check-recursive] Error 1
make[1]: Leaving directory `/tmp/buildd/libindicator-0.3.8'
dh_auto_test: make -j1 check returned exit code 2
make: *** [build] Error 29

Related branches

Evgeni Golov (evgeni)
description: updated
Revision history for this message
Sebastien Bacher (seb128) wrote :

Seems that session.conf.in and the different services.in in the test dir should be added to EXTRA_DIST

Changed in libindicator:
assignee: nobody → Ted Gould (ted)
status: New → Confirmed
Ted Gould (ted)
Changed in libindicator:
status: Confirmed → Fix Committed
Ted Gould (ted)
Changed in libindicator:
status: Fix Committed → Fix Released
To post a comment you must log in.
This report contains Public information  Edit
Everyone can see this information.

Other bug subscribers