trunk: make check fails (hpgl_output)

Bug #1286977 reported by su_v on 2014-03-03
6
This bug affects 1 person
Affects Status Importance Assigned to Milestone
Inkscape
High
jazzynico

Bug Description

Making check in src
make check-am
make cxxtests
  CXX cxxtests.o
  CXXLD cxxtests
make check-TESTS
XFAIL: cxxtests
FAIL: ../share/extensions/test/run-all-extension-tests
make all-am
make[6]: Nothing to be done for `all-am'.
============================================================================
Testsuite summary for inkscape 0.48+devel
============================================================================
# TOTAL: 2
# PASS: 0
# SKIP: 0
# XFAIL: 1
# FAIL: 1
# XPASS: 0
# ERROR: 0
============================================================================
See src/test-suite.log
Please report to http://bugs.launchpad.net/inkscape/+filebug
============================================================================
make[4]: *** [test-suite.log] Error 1
make[3]: *** [check-TESTS] Error 2
make[2]: *** [check-am] Error 2
make[1]: *** [check] Error 2
make: *** [check-recursive] Error 1

From src/test-suite.log:

Failed 1 of 49 extension tests:
  - hpgl_output

Inkscape 0.48+devel r13097, OS X 10.7.5

jazzynico (jazzynico) wrote :

Confirmed on Crunchbang Waldorf, Inkscape trunk revision 13097.

Changed in inkscape:
status: New → Triaged
jazzynico (jazzynico) wrote :

Fixed revision 13098.

Changed in inkscape:
assignee: nobody → jazzynico (jazzynico)
milestone: 0.91 → none
status: Triaged → Fix Released
To post a comment you must log in.
This report contains Public information  Edit
Everyone can see this information.

Other bug subscribers