GTK3: Build failure with r12971

Bug #1271802 reported by su_v on 2014-01-23
6
This bug affects 1 person
Affects Status Importance Assigned to Milestone
Inkscape
Undecided
su_v

Bug Description

Build log (r12974, OS X 10.7.5):

  CXX document.o
../../src/document.cpp: In member function ‘SPDocument* SPDocument::createChildDoc(const gchar*)’:
../../src/document.cpp:485: error: ‘build_filename’ is not a member of ‘Glib’
make[3]: *** [document.o] Error 1
make[2]: *** [all] Error 2
make[1]: *** [all-recursive] Error 1
make: *** [all] Error 2

Please review attached patch to fix building trunk with GTK3.

su_v (suv-lp) wrote :
jazzynico (jazzynico) wrote :

Build error confirmed on Crunchbang Waldorf, Inkscape trunk revision 12974.

Patch tested successfully. Feel free to commit!

Changed in inkscape:
assignee: nobody → ~suv (suv-lp)
milestone: none → 0.91
status: New → In Progress
su_v (suv-lp) wrote :

@jazzynico: thx for testing!

Fix committed in r12975.

Changed in inkscape:
milestone: 0.91 → none
status: In Progress → Fix Released
To post a comment you must log in.
This report contains Public information  Edit
Everyone can see this information.

Other bug subscribers