Gloobus-preview won't compile

Reported by bjesus on 2010-04-25
8
This bug affects 1 person
Affects Status Importance Assigned to Milestone
gloobus-preview
Undecided
Unassigned

Bug Description

I get this when I try to compile the latest code:

[...]

mv -f .deps/gloobus-preview-interface-free.Tpo .deps/gloobus-preview-interface-free.Po
g++ -DHAVE_CONFIG_H -I. -I.. -D'PACKAGE_DATA_PATH="/usr/share/gloobus"' -D'PACKAGE_LIB_PATH="/usr/lib/gloobus"' -D'LOCALEDIR="/usr/share/locale"' -I/usr/include/cairo -I/usr/include/pixman-1 -I/usr/include/freetype2 -I/usr/include/libpng14 -pthread -I/usr/include/gtk-2.0 -I/usr/lib/gtk-2.0/include -I/usr/include/atk-1.0 -I/usr/include/cairo -I/usr/include/pango-1.0 -I/usr/include/glib-2.0 -I/usr/lib/glib-2.0/include -I/usr/include/pixman-1 -I/usr/include/freetype2 -I/usr/include/libpng14 -DORBIT2=1 -pthread -I/usr/include/libgnomeui-2.0 -I/usr/include/libart-2.0 -I/usr/include/gconf/2 -I/usr/include/gnome-keyring-1 -I/usr/include/libgnome-2.0 -I/usr/include/libbonoboui-2.0 -I/usr/include/libgnomecanvas-2.0 -I/usr/include/gtk-2.0 -I/usr/include/gnome-vfs-2.0 -I/usr/lib/gnome-vfs-2.0/include -I/usr/include/orbit-2.0 -I/usr/include/dbus-1.0 -I/usr/lib/dbus-1.0/include -I/usr/include/glib-2.0 -I/usr/lib/glib-2.0/include -I/usr/include/libbonobo-2.0 -I/usr/include/bonobo-activation-2.0 -I/usr/include/libxml2 -I/usr/include/pango-1.0 -I/usr/include/gail-1.0 -I/usr/include/freetype2 -I/usr/include/atk-1.0 -I/usr/lib/gtk-2.0/include -I/usr/include/cairo -I/usr/include/pixman-1 -I/usr/include/libpng14 -pthread -I/usr/include/gtksourceview-2.0 -I/usr/include/libxml2 -I/usr/include/gtk-2.0 -I/usr/lib/gtk-2.0/include -I/usr/include/atk-1.0 -I/usr/include/cairo -I/usr/include/pango-1.0 -I/usr/include/glib-2.0 -I/usr/lib/glib-2.0/include -I/usr/include/pixman-1 -I/usr/include/freetype2 -I/usr/include/libpng14 -I/usr/include/glib-2.0 -I/usr/lib/glib-2.0/include -Wall -Werror -march=x86-64 -mtune=generic -O2 -pipe -MT gloobus-preview-singleton.o -MD -MP -MF .deps/gloobus-preview-singleton.Tpo -c -o gloobus-preview-singleton.o gloobus-preview-singleton.cpp
cc1plus: warnings being treated as errors
In file included from gloobus-preview-singleton.cpp:5:0:
gloobus-preview-interface-default.h: In member function ‘virtual GdkPixbuf* iDefault::get_pixbuf()’:
gloobus-preview-interface-default.h:44:83: error: passing NULL to non-pointer argument 4 of ‘gboolean gnome_thumbnail_factory_can_thumbnail(GnomeThumbnailFactory*, const char*, const char*, time_t)’
make[3]: *** [gloobus-preview-singleton.o] Error 1
make[3]: Leaving directory `/tmp/clyde-bjesus/gloobus-preview-bzr/gloobus-preview-bzr/src/gloobus-preview-build/src'
make[2]: *** [all-recursive] Error 1
make[2]: Leaving directory `/tmp/clyde-bjesus/gloobus-preview-bzr/gloobus-preview-bzr/src/gloobus-preview-build/src'
make[1]: *** [all-recursive] Error 1
make[1]: Leaving directory `/tmp/clyde-bjesus/gloobus-preview-bzr/gloobus-preview-bzr/src/gloobus-preview-build'
make: *** [all] Error 2

Running Arch Linux, x86_64.

Am I missing something?

ammonkey (am-monkeyd) on 2010-05-24
Changed in gloobus-preview:
status: New → Fix Committed
To post a comment you must log in.
This report contains Public information  Edit
Everyone can see this information.

Other bug subscribers