revno: 908; make install died

Bug #1401857 reported by palik on 2014-12-12
16
This bug affects 3 people
Affects Status Importance Assigned to Milestone
Gearman
Medium
Unassigned

Bug Description

Hi, on debian wheezy make install died.
For any replay thanks in advance.

----------------------------------------------
gearman$ make install
make -j2 install-recursive
make[1]: Entering directory `/home/apastuchov/development/gearmand'
Making install in docs
make[2]: Entering directory `/home/apastuchov/development/gearmand/docs'
make[2]: warning: -jN forced in submake: disabling jobserver mode.
make[2]: *** No rule to make target `install'. Stop.
make[2]: Leaving directory `/home/apastuchov/development/gearmand/docs'
make[1]: *** [install-recursive] Error 1
make[1]: Leaving directory `/home/apastuchov/development/gearmand'
make: *** [install] Error 2

----------------------------------------------
BOOTSTRAP ENV
AUTORECONF=/usr/bin/autoreconf
HOST_OS=x86_64-debian-debian-7-Linux-3.2.0-4-amd64
VENDOR=debian
VENDOR_DISTRIBUTION=debian
VENDOR_RELEASE=7
getopt()
--print-env
MAKE=/usr/bin/make
BOOTSTRAP_TARGET=make_default
VCS_CHECKOUT=bzr
WARNINGS=all,error

Related branches

palik (1-infe-w) wrote :
palik (1-infe-w) wrote :

same error on ubuntu.

gearmand$ make install
make -j5 install-recursive
make[1]: Entering directory `/home/palik/workspace/batch0-01/gearmand'
Making install in docs
make[2]: Entering directory `/home/palik/workspace/batch0-01/gearmand/docs'
make[2]: warning: -jN forced in submake: disabling jobserver mode.
make[2]: *** No rule to make target `install'. Stop.
make[2]: Leaving directory `/home/palik/workspace/batch0-01/gearmand/docs'
make[1]: *** [install-recursive] Error 1
make[1]: Leaving directory `/home/palik/workspace/batch0-01/gearmand'
make: *** [install] Error 2

----------------------------------------------
BOOTSTRAP ENV
AUTORECONF=/usr/bin/autoreconf
HOST_OS=x86_64-canonical-ubuntu-14.04-Linux-3.13.0-39-generic
VENDOR=canonical
VENDOR_DISTRIBUTION=ubuntu
VENDOR_RELEASE=14.04
getopt()
--print-env
MAKE=/usr/bin/make
BOOTSTRAP_TARGET=make_default
VCS_CHECKOUT=bzr
WARNINGS=all,error
----------------------------------------------

palik (1-infe-w) wrote :

an empty install rule added into docs/Makefile solved the problem

Daniel Convissor (convissor) wrote :

@palik Thanks for the idea. Added a pull request that does that.

Changed in gearmand:
status: New → Confirmed
Clint Byrum (clint-fewbar) wrote :
Changed in gearmand:
status: Confirmed → Fix Committed
importance: Undecided → Medium
To post a comment you must log in.
This report contains Public information  Edit
Everyone can see this information.

Other bug subscribers