File compile failure

Bug #1812139 reported by jerry on 2019-01-17
10
This bug affects 2 people
Affects Status Importance Assigned to Milestone
GNU Arm Embedded Toolchain
Undecided
Unassigned

Bug Description

Just tried to use the new release of GNU Arm Embedded to build one of my programs. The build fails at link stage (LTO enabled):

c:/program files (x86)/gnu tools arm embedded/8 2018-q4-major/bin/../lib/gcc/arm-none-eabi/8.2.1/../../../../arm-none-eabi/bin/ld.exe: C:\Users\Jerry\AppData\Local\Temp\ccaZJHsddebugobjtem: file not recognized: file truncated
collect2.exe: error: ld returned 1 exit status
lto-wrapper.exe: fatal error: arm-none-eabi-gcc returned 1 exit status
compilation terminated.
c:/program files (x86)/gnu tools arm embedded/8 2018-q4-major/bin/../lib/gcc/arm-none-eabi/8.2.1/../../../../arm-none-eabi/bin/ld.exe: error: lto-wrapper failed
collect2.exe: error: ld returned 1 exit status

Anyone could help?
Thanks Jerry

This report contains Public information  Edit
Everyone can see this information.

Other bug subscribers