Build failures in drizzled/plugin/table_function on several platforms

Bug #530391 reported by Lee Bieber on 2010-03-01
6
This bug affects 1 person
Affects Status Importance Assigned to Milestone
Drizzle
Critical
Brian Aker
Cherry
Critical
Brian Aker

Bug Description

See http://hudson.drizzle.org/view/Drizzle-build/job/drizzle-build-ubuntu910-32bit/28/console for complete log:

  CC plugin/innobase/btr/plugin_innobase_libinnobase_la-btr0btr.lo
../plugin/innobase/handler/data_dictionary.cc: In member function ‘virtual bool CmpTool::Generator::populate()’:
../plugin/innobase/handler/data_dictionary.cc:77: error: call of overloaded ‘push(ulint&)’ is ambiguous
../drizzled/plugin/table_function.h:108: note: candidates are: void drizzled::plugin::TableFunction::Generator::push(uint64_t)
../drizzled/plugin/table_function.h:109: note: void drizzled::plugin::TableFunction::Generator::push(int64_t)
../drizzled/plugin/table_function.h:112: note: void drizzled::plugin::TableFunction::Generator::push(bool)
../plugin/innobase/handler/data_dictionary.cc:78: error: call of overloaded ‘push(ulint&)’ is ambiguous
../drizzled/plugin/table_function.h:108: note: candidates are: void drizzled::plugin::TableFunction::Generator::push(uint64_t)
../drizzled/plugin/table_function.h:109: note: void drizzled::plugin::TableFunction::Generator::push(int64_t)
../drizzled/plugin/table_function.h:112: note: void drizzled::plugin::TableFunction::Generator::push(bool)
../plugin/innobase/handler/data_dictionary.cc:80: error: call of overloaded ‘push(ulint&)’ is ambiguous
../drizzled/plugin/table_function.h:108: note: candidates are: void drizzled::plugin::TableFunction::Generator::push(uint64_t)
../drizzled/plugin/table_function.h:109: note: void drizzled::plugin::TableFunction::Generator::push(int64_t)
../drizzled/plugin/table_function.h:112: note: void drizzled::plugin::TableFunction::Generator::push(bool)
../plugin/innobase/handler/data_dictionary.cc: In member function ‘virtual bool CmpmemTool::Generator::populate()’:
../plugin/innobase/handler/data_dictionary.cc:131: error: call of overloaded ‘push(ulint&)’ is ambiguous
../drizzled/plugin/table_function.h:108: note: candidates are: void drizzled::plugin::TableFunction::Generator::push(uint64_t)
../drizzled/plugin/table_function.h:109: note: void drizzled::plugin::TableFunction::Generator::push(int64_t)
../drizzled/plugin/table_function.h:112: note: void drizzled::plugin::TableFunction::Generator::push(bool)
../plugin/innobase/handler/data_dictionary.cc:133: error: call of overloaded ‘push(long unsigned int)’ is ambiguous
../drizzled/plugin/table_function.h:108: note: candidates are: void drizzled::plugin::TableFunction::Generator::push(uint64_t)
../drizzled/plugin/table_function.h:109: note: void drizzled::plugin::TableFunction::Generator::push(int64_t)
../drizzled/plugin/table_function.h:112: note: void drizzled::plugin::TableFunction::Generator::push(bool)
../plugin/innobase/handler/data_dictionary.cc: In member function ‘void InnodbTrxTool::Generator::populate_innodb_locks()’:
../plugin/innobase/handler/data_dictionary.cc:301: error: call of overloaded ‘push(ulint&)’ is ambiguous
../drizzled/plugin/table_function.h:108: note: candidates are: void drizzled::plugin::TableFunction::Generator::push(uint64_t)
../drizzled/plugin/table_function.h:109: note: void drizzled::plugin::TableFunction::Generator::push(int64_t)
../drizzled/plugin/table_function.h:112: note: void drizzled::plugin::TableFunction::Generator::push(bool)
../plugin/innobase/handler/data_dictionary.cc:302: error: call of overloaded ‘push(ulint&)’ is ambiguous
../drizzled/plugin/table_function.h:108: note: candidates are: void drizzled::plugin::TableFunction::Generator::push(uint64_t)
../drizzled/plugin/table_function.h:109: note: void drizzled::plugin::TableFunction::Generator::push(int64_t)
../drizzled/plugin/table_function.h:112: note: void drizzled::plugin::TableFunction::Generator::push(bool)
../plugin/innobase/handler/data_dictionary.cc:303: error: call of overloaded ‘push(ulint&)’ is ambiguous
../drizzled/plugin/table_function.h:108: note: candidates are: void drizzled::plugin::TableFunction::Generator::push(uint64_t)
../drizzled/plugin/table_function.h:109: note: void drizzled::plugin::TableFunction::Generator::push(int64_t)
../drizzled/plugin/table_function.h:112: note: void drizzled::plugin::TableFunction::Generator::push(bool)
../plugin/innobase/handler/data_dictionary.cc: In member function ‘void InnodbTrxTool::Generator::populate_innodb_trx()’:
../plugin/innobase/handler/data_dictionary.cc:319: error: call of overloaded ‘push(ib_time_t&)’ is ambiguous
../drizzled/plugin/table_function.h:108: note: candidates are: void drizzled::plugin::TableFunction::Generator::push(uint64_t)
../drizzled/plugin/table_function.h:109: note: void drizzled::plugin::TableFunction::Generator::push(int64_t)
../drizzled/plugin/table_function.h:112: note: void drizzled::plugin::TableFunction::Generator::push(bool)
../plugin/innobase/handler/data_dictionary.cc:324: error: call of overloaded ‘push(ib_time_t&)’ is ambiguous
../drizzled/plugin/table_function.h:108: note: candidates are: void drizzled::plugin::TableFunction::Generator::push(uint64_t)
../drizzled/plugin/table_function.h:109: note: void drizzled::plugin::TableFunction::Generator::push(int64_t)
../drizzled/plugin/table_function.h:112: note: void drizzled::plugin::TableFunction::Generator::push(bool)
../plugin/innobase/handler/data_dictionary.cc:333: error: call of overloaded ‘push(ulint&)’ is ambiguous
../drizzled/plugin/table_function.h:108: note: candidates are: void drizzled::plugin::TableFunction::Generator::push(uint64_t)
../drizzled/plugin/table_function.h:109: note: void drizzled::plugin::TableFunction::Generator::push(int64_t)
../drizzled/plugin/table_function.h:112: note: void drizzled::plugin::TableFunction::Generator::push(bool)
make[3]: *** [plugin/innobase/handler/plugin_libinnobase_plugin_la-data_dictionary.lo] Error 1
make[3]: *** Waiting for unfinished jobs....
make[3]: Leaving directory `/home/hudson/hudson/workspace/drizzle-build-ubuntu910-32bit/drizzle-2010.03.1332/_build'
make[2]: *** [all-recursive] Error 1
make[2]: Leaving directory `/home/hudson/hudson/workspace/drizzle-build-ubuntu910-32bit/drizzle-2010.03.1332/_build'
make[1]: *** [all] Error 2
make[1]: Leaving directory `/home/hudson/hudson/workspace/drizzle-build-ubuntu910-32bit/drizzle-2010.03.1332/_build'
make: *** [distcheck] Error 1
Sending e-mails to: <email address hidden>
Finished: FAILURE

Page generated: Mar 1, 2010 3:45:16 PMHudson ver. 1.348

Lee Bieber (kalebral) on 2010-03-01
Changed in drizzle:
importance: Undecided → Critical
status: New → Confirmed
milestone: none → 2010-03-15
assignee: nobody → Monty Taylor (mordred)
Monty Taylor (mordred) wrote :

This is in the new data_dictionary code... I imagine brian will have a better idea of the fix than me.

Lee Bieber (kalebral) on 2010-03-02
summary: - Build failures in drizzled/plugin/table_function on ubuntu 32bit
+ Build failures in drizzled/plugin/table_function on several platforms
To post a comment you must log in.
This report contains Public information  Edit
Everyone can see this information.

Other bug subscribers