make check fails on openSUSE

Bug #940110 reported by Vincent Untz on 2012-02-24
6
This bug affects 1 person
Affects Status Importance Assigned to Milestone
Déjà Dup
Undecided
Unassigned

Bug Description

make[2]: Entering directory `/home/abuild/rpmbuild/BUILD/deja-dup-21.90/tests/common'
dbus-launch ./common
/unit/testing_mode: OK
/unit/get_day: OK
/unit/parse_dir: OK
/unit/parse_dir_list: OK
/unit/mode_to_string: OK
/backup/bad_volume: OK
/backup/no_space: OK
/backup/bad_hostname: OK
/backup/cancel_noop: OK
/backup/cancel:
** WARNING **: common.vala:110: Mockscript file still exists
make[2]: *** [check] Trace/breakpoint trap
make[2]: Leaving directory `/home/abuild/rpmbuild/BUILD/deja-dup-21.90/tests/common'

Unfortunately, this only happens when building on our build server; if I do a local build, things go fine :/

Michael Terry (mterry) wrote :

Is this still happening?

Changed in deja-dup:
status: New → Incomplete
Vincent Untz (vuntz) wrote :

Now, with 24.0, we're hitting this:

[ 403s] make[3]: Leaving directory `/home/abuild/rpmbuild/BUILD/deja-dup-24.0/tests/runner'
[ 412s] /scripts/bad-hostname:
[ 412s] ** (/home/abuild/rpmbuild/BUILD/deja-dup-24.0/tests/runner/.libs/runner:29695): WARNING **: runner.vala:215: Error string didn't match; expected (null), got Your backup appears to be corrupted. You should delete the backup and try again.
[ 412s] /bin/sh: line 1: 29695 Trace/breakpoint trap dbus-launch ./runner $test
[ 412s] make[2]: *** [check] Error 133

(we disable "make check" for our package now to ignore those kind of issues)

Changed in deja-dup:
status: Incomplete → New
Michael Terry (mterry) on 2012-10-25
summary: - "make check" fails when building openSUSE package for 21.90
+ make check fails on openSUSE

The original issue is gone however lot's of other tests now fail https://build.opensuse.org/package/show/home:Mailaender:branches:GNOME:Apps/deja-dup

[ 496s] 70% tests passed, 28 tests failed out of 93
[ 496s]
[ 496s] Total Test time (real) = 260.19 sec
[ 496s]
[ 496s] The following tests FAILED:
[ 496s] 48 - symlink-recursive.test (OTHER_FAULT)
[ 496s] 49 - disk-full2.test (OTHER_FAULT)
[ 496s] 50 - disk-full.test (OTHER_FAULT)
[ 496s] 51 - clean-incomplete.test (OTHER_FAULT)
[ 496s] 52 - read-error.test (OTHER_FAULT)
[ 496s] 54 - encrypt-detect.test (OTHER_FAULT)
[ 496s] 55 - symlink-subdir.test (OTHER_FAULT)
[ 496s] 56 - delete-too-old.test (OTHER_FAULT)
[ 496s] 57 - symlink-trickshot.test (OTHER_FAULT)
[ 496s] 58 - symlink-exclude.test (OTHER_FAULT)
[ 496s] 59 - symlink-exclude2.test (OTHER_FAULT)
[ 496s] 61 - special-chars.test (OTHER_FAULT)
[ 496s] 62 - delete-just-right.test (OTHER_FAULT)
[ 496s] 64 - symlink-follow.test (OTHER_FAULT)
[ 496s] 65 - threshold-full.test (OTHER_FAULT)
[ 496s] 71 - symlink-direct.test (OTHER_FAULT)
[ 496s] 72 - nag.test (OTHER_FAULT)
[ 496s] 75 - threshold-inc.test (OTHER_FAULT)
[ 496s] 76 - clean-cache-if-full.test (OTHER_FAULT)
[ 496s] 80 - bad-hostname.test (OTHER_FAULT)
[ 496s] 81 - clean-tempdir.test (OTHER_FAULT)
[ 496s] 82 - symlink-loop.test (OTHER_FAULT)
[ 496s] 84 - symlink-follow2.test (OTHER_FAULT)
[ 496s] 85 - delete-never.test (OTHER_FAULT)
[ 496s] 86 - delete-too-few.test (OTHER_FAULT)
[ 496s] 87 - encrypt-ask.test (OTHER_FAULT)
[ 496s] 89 - mkdir.test (OTHER_FAULT)
[ 496s] 91 - excludes.test (OTHER_FAULT)
[ 496s] Errors while running CTest

To post a comment you must log in.
This report contains Public information  Edit
Everyone can see this information.

Other bug subscribers