Debian GNU/Linux

sd version 0.74-1 failed to build on i386

Reported by Matthias Klose on 2011-04-10
8
This bug affects 1 person
Affects Status Importance Assigned to Milestone
sd (Debian)
Fix Released
Unknown
sd (Ubuntu)
High
Unassigned
Oneiric
High
Unassigned

Bug Description

sd version 0.74-1 failed to build on i386
Link to failed build: https://launchpad.net/ubuntu/+archive/test-rebuild-20110329/+buildjob/2410071

Direct link to the build log: https://launchpad.net/ubuntu/+archive/test-rebuild-20110329/+buildjob/2410071/+files/buildlog_ubuntu-natty-i386.sd_0.74-1_FAILEDTOBUILD.txt.gz

This log snippet might be of interest, since it triggered the matcher 'Purging chroot-autobuild'.
Excerpt 1809 lines into the build log:

  Parse errors: No plan found in TAP output
t/sd-validation.t (Wstat: 65280 Tests: 0 Failed: 0)
  Non-zero exit status: 255
  Parse errors: No plan found in TAP output
t/server.t (Wstat: 65280 Tests: 0 Failed: 0)
  Non-zero exit status: 255
  Parse errors: No plan found in TAP output
Files=45, Tests=0, 8 wallclock secs ( 0.10 usr 0.09 sys + 5.89 cusr 0.93 csys = 7.01 CPU)
Result: FAIL
Failed 45/45 test programs. 0/0 subtests failed.
make[1]: *** [test_dynamic] Error 255
make[1]: Leaving directory `/build/buildd/sd-0.74'
dh_auto_test: make -j1 test returned exit code 2
make: *** [build] Error 29
dpkg-buildpackage: error: debian/rules build gave error exit status 2
******************************************************************************
Build finished at 20110408-1459
FAILED [dpkg-buildpackage died]
Purging chroot-autobuild/build/buildd/sd-0.74

Related branches

Matthias Klose (doko) on 2011-04-10
Changed in sd (Ubuntu):
importance: Undecided → High
tags: added: oneiric
Changed in sd (Ubuntu):
milestone: none → oneiric-alpha-1
Changed in sd (Ubuntu Oneiric):
milestone: oneiric-alpha-1 → oneiric-alpha-2
Changed in sd (Ubuntu Oneiric):
milestone: oneiric-alpha-2 → none
status: New → Confirmed
tags: added: universe
Andreas Moog (amoog) wrote :

Fixed upstream and will be in next Debian Release - hopefully this will be before FF.

Changed in sd (Ubuntu Oneiric):
status: Confirmed → Triaged
status: Triaged → Fix Committed
status: Fix Committed → Triaged
tags: added: fixed-upstream
Changed in sd (Debian):
status: Unknown → Fix Committed
Launchpad Janitor (janitor) wrote :

This bug was fixed in the package sd - 0.75-0ubuntu1

---------------
sd (0.75-0ubuntu1) oneiric; urgency=low

  * New upstream version.
    - Fails not all tests like 0.74, but just a handful. Run the tests
      and ignore the failing tests. LP: #755993.
 -- Matthias Klose <email address hidden> Mon, 19 Sep 2011 18:29:25 +0200

Changed in sd (Ubuntu Oneiric):
status: Triaged → Fix Released
Changed in sd (Debian):
status: Fix Committed → Confirmed
Changed in sd (Debian):
status: Confirmed → Fix Released
To post a comment you must log in.
This report contains Public information  Edit
Everyone can see this information.

Other bug subscribers

Remote bug watches

Bug watches keep track of this bug in other bug trackers.