Linking CXX executable compiz_test_wall_offset_movement - /usr/bin/ld: cannot find -lcompiz_core

Bug #1084386 reported by Daniel van Vugt on 2012-11-29
6
This bug affects 1 person
Affects Status Importance Assigned to Milestone
Compiz Main Plugins
High
Daniel van Vugt

Bug Description

The latest lp:compiz-plugins-main fails to build against the latest lp:compiz-core ...

Linking CXX executable compiz_test_wall_offset_movement
/usr/bin/ld: cannot find -lcompiz_core
collect2: error: ld returned 1 exit status
make[2]: *** [wall/src/offset_movement/tests/compiz_test_wall_offset_movement] Error 1
make[1]: *** [wall/src/offset_movement/tests/CMakeFiles/compiz_test_wall_offset_movement.dir/all] Error 2
make[1]: *** Waiting for unfinished jobs....

Related branches

Daniel van Vugt (vanvugt) wrote :

This looks like bug 1084162 but Unity is not involved. Also I need a fix that is self-contained in compiz-plugins-main.

affects: compiz-core → compiz-plugins-main
Changed in compiz-plugins-main:
milestone: none → 0.9.7.4
importance: Undecided → High
status: New → In Progress
assignee: nobody → Daniel van Vugt (vanvugt)
Daniel van Vugt (vanvugt) wrote :

Fix committed to lp:compiz-plugins-main at revision 36, scheduled for release in Compiz Main Plugins 0.9.7.4

Changed in compiz-plugins-main:
status: In Progress → Fix Committed
To post a comment you must log in.
This report contains Public information  Edit
Everyone can see this information.

Other bug subscribers