test failures in bzr.dev when run with LC_ALL=C

Bug #1086209 reported by Jelmer Vernooij on 2012-12-04
6
This bug affects 1 person
Affects Status Importance Assigned to Milestone
Bazaar
Medium
Vincent Ladeuil

Bug Description

FAIL: bzrlib.tests.test_ui.TestTextUIFactory.test_text_factory_utf8_password
----------------------------------------------------------------------
_StringException: Empty attachments:
  log

Traceback (most recent call last):
  File "/tmp/buildd/bzr-2.6.0~bzr6571/build/lib.linux-x86_64-2.7/bzrlib/tests/test_ui.py", line 110, in test_text_factory_utf8_password
    ui.stderr.getvalue().decode('utf8'))
AssertionError: not equal:
a = u'Hello \u1234 some\u1234: '
b = u'Hello ? some?: '

======================================================================
FAIL: bzrlib.tests.test_ui.TestTextUIFactory.test_text_ui_getusername_utf8
----------------------------------------------------------------------
_StringException: Empty attachments:
  log

Traceback (most recent call last):
  File "/tmp/buildd/bzr-2.6.0~bzr6571/build/lib.linux-x86_64-2.7/bzrlib/tests/test_ui.py", line 287, in test_text_ui_getusername_utf8
    ui.stderr.getvalue().decode("utf8"))
AssertionError: not equal:
a = u'Hello some\u1234: '
b = u'Hello some?: '

Related branches

Jelmer Vernooij (jelmer) wrote :

This is presumably a regression from r6568.

Vincent Ladeuil (vila) on 2012-12-04
Changed in bzr:
status: New → In Progress
assignee: nobody → Vincent Ladeuil (vila)
importance: Undecided → Medium
Jelmer Vernooij (jelmer) on 2012-12-13
Changed in bzr:
status: In Progress → Fix Released
To post a comment you must log in.
This report contains Public information  Edit
Everyone can see this information.

Other bug subscribers