Launchpad.net

lgw01-amd64-056

lgw01-amd64-056 builds amd64 and i386 binaries and is owned by William Grant.

View full history Current status

24711209 [building] Building i386 build of devscripts 2.19.7ubuntu1 in ubuntu focal PROPOSED

Started 15 minutes, 39.0 seconds ago.

Buildlog

specified download version is 3.0
gpgv: Signature made Sat Oct 19 07:51:58 2019 UTC
gpgv: using RSA key CF218F0E7EABF584B7E20402C77E2D6872543FAF
gpgv: Good signature from "uscan test key (no secret) <none@debian.org>"
Skip adding upstream signature since upstream file is repacked.
mv ../foo_2.0.orig.tar.gz to ../foo_2.0+~3.0+~3.0.orig.tar.gz
mv ../foo_3.0.orig-bar.tar.gz to ../foo_2.0+~3.0+~3.0.orig-bar.tar.gz
mv ../foo_3.0.orig-baz.tar.gz to ../foo_2.0+~3.0+~3.0.orig-baz.tar.gz
Successfully repacked ../baz-3.0.tar.gz as ../foo_3.0.orig-baz.tar.gz, deleting 8 files from it.

testWatch4WebNonNativeGroupWithCompression
uscan: Newest version of foo on remote site is 2.0, local version is 1.0
uscan: => Newer package available from
      http://localhost:41530/2.0/foo/ooo/foo-2.0.tar.gz
uscan: Newest version of bar on remote site is 3.0, local version is 0
uscan: => Newer package available from
      http://localhost:41530/3.0/bar/ooo/bar-3.0.tar.gz
uscan: Newest version of baz on remote site is 3.0, local version is 0
uscan: => Newer package available from
      http://localhost:41530/3.0/baz/ooo/baz-3.0.tar.gz
Successfully symlinked ../foo-2.0.tar.gz to ../foo_2.0.orig.tar.gz.
Successfully repacked ../bar-3.0.tar.gz as ../foo_3.0.orig-bar.tar.gz, deleting 8 files from it.
mv ../foo_2.0.orig.tar.gz to ../foo_2.0+~3.0+~3.0.orig.tar.gz
mv ../foo_3.0.orig-bar.tar.gz to ../foo_2.0+~3.0+~3.0.orig-bar.tar.gz
mv ../foo_3.0.orig-baz.tar.gz to ../foo_2.0+~3.0+~3.0.orig-baz.tar.gz
Successfully repacked ../baz-3.0.tar.gz as ../foo_3.0.orig-baz.tar.gz, deleting 8 files from it.

Ran 42 tests.

OK
make[3]: Leaving directory '/<<PKGBUILDDIR>>/test'
make[2]: *** [Makefile:60: test_test] Error 2
make[2]: Leaving directory '/<<PKGBUILDDIR>>'
make[1]: *** [Makefile:44: test] Error 2
make[1]: Leaving directory '/<<PKGBUILDDIR>>'
dh_auto_test: make -j4 test returned exit code 2
make: *** [debian/rules:13: binary-arch] Error 255
dpkg-buildpackage: error: debian/rules binary-arch subprocess returned exit status 2

Builder information

Architectures:
amd64 i386 (virtual)
Location:
http://lgw01-amd64-056.vbuilder.lgw01.scalingstack:8221/
Owner:
William Grant
Mode:
This builder is in auto-mode and accepting jobs from the auto-build system.
Version:
178