nice version 0.9.13-3.2 failed to build with openjdk-7

Bug #888986 reported by James Page
8
This bug affects 1 person
Affects Status Importance Assigned to Milestone
nice (Ubuntu)
Invalid
Undecided
Unassigned

Bug Description

During a rebuild test on precise with default-jdk switched to openjdk-7, a build failure was detected for nice version 0.9.13-3.2.

See attached log for full build failure details.

This log snippet might also be of interest:

nice.tools.visibility: writing in archive
nice.getopt: writing in archive
nice.doc: writing in archive
compilation completed with 1 warning
Building nicedoc...
JAVA="java" bin/nicec --exclude-runtime -d classes --sourcepath=stdlib:src nice.tools.doc
nice.lang: parsing
nice.tools.visibility: parsing
nice.tools.ast: parsing
mlsub.compilation: parsing
nice.tools.locator: parsing
nice.tools.repository: parsing
bossa.modules: parsing
bossa.syntax: parsing
nice.getopt: parsing
nice.doc: parsing
nice.tools.compiler: parsing
nice.tools.compiler.console: parsing
nice.tools.doc: parsing
nice.tools.doc: typechecking
nice.tools.doc: generating code
nice.tools.doc: linking
Building niceunit...
JAVA="java" bin/nicec --exclude-runtime -d classes --sourcepath=stdlib:src nice.tools.unit.console
nice.lang: parsing
nice.tools.locator: parsing
nice.tools.unit: parsing
nice.getopt: parsing
nice.doc: parsing
nice.tools.unit.console: parsing
nice.tools.unit: typechecking

/«PKGBUILDDIR»/src/nice/tools/unit/api.nice: line 45, column 7:
warning: Comparing a non-null value with null

/«PKGBUILDDIR»/src/nice/tools/unit/api.nice: line 107, column 10:
Ambiguity for symbol new java.net.URLClassLoader. Possibilities are :
java.net.URLClassLoader new java.net.URLClassLoader(java.net.URL[?], ?java.lang.ClassLoader)
java.net.URLClassLoader new java.net.URLClassLoader(java.net.URL[?], ?java.security.AccessControlContext)
compilation failed with 1 error and 1 warning
make[1]: *** [unit] Error 2
make: *** [build-stamp] Error 2
make[1]: Leaving directory `/«PKGBUILDDIR»'
dpkg-buildpackage: error: debian/rules build gave error exit status 2
────────────────────────────────────────────────────────────────────────────────
Build finished at 20111110-0420

Finished
────────

E: Build failure (dpkg-buildpackage died)

Revision history for this message
James Page (james-page) wrote : Build log
tags: added: amd64 auto java7-ftbfs
James Page (james-page)
tags: added: lang
James Page (james-page)
Changed in nice (Ubuntu):
status: New → Invalid
To post a comment you must log in.
This report contains Public information  
Everyone can see this information.

Other bug subscribers

Bug attachments

Remote bug watches

Bug watches keep track of this bug in other bug trackers.