package memtest86+ 4.20-1.1ubuntu1 failed to install/upgrade: ErrorMessage: subprocess installed post-installation script returned error exit status 1

Bug #1016008 reported by Allysan
6
This bug affects 1 person
Affects Status Importance Assigned to Milestone
memtest86+ (Ubuntu)
New
Undecided
Unassigned

Bug Description

Error occurred while upgrading from Ubuntu Server x64 10.04 to 12.04.
Came as a result of running do-release-upgrade -d.

ProblemType: Package
DistroRelease: Ubuntu 12.04
Package: memtest86+ 4.20-1.1ubuntu1
ProcVersionSignature: Ubuntu 2.6.32-41.91-server 2.6.32.59+drm33.24
Uname: Linux 2.6.32-41-server x86_64
ApportVersion: 2.0.1-0ubuntu10
Architecture: amd64
Date: Thu Jun 21 01:00:50 2012
ErrorMessage: ErrorMessage: subprocess installed post-installation script returned error exit status 1
SourcePackage: memtest86+
Title: package memtest86+ 4.20-1.1ubuntu1 failed to install/upgrade: ErrorMessage: subprocess installed post-installation script returned error exit status 1
UpgradeStatus: Upgraded to precise on 2012-06-21 (0 days ago)

Revision history for this message
Allysan (a-n-katch) wrote :
Revision history for this message
Brian Murray (brian-murray) wrote :

From VarLogDistupgradeApttermlog.gz:

Setting up linux-image-3.2.0-26-generic (3.2.0-26.41) ...
Running depmod.
update-initramfs: deferring update (hook will be called later)
Running postinst hook script /usr/sbin/update-grub.
Generating grub.cfg ...
/usr/sbin/grub-probe: error: failed to get canonical path of /boot/grub/locale.
/usr/sbin/grub-probe: error: cannot stat `'.
User postinst hook script [/usr/sbin/update-grub] exited with value 1
dpkg: error processing linux-image-3.2.0-26-generic (--configure):
 subprocess installed post-installation script returned error exit status 1

Revision history for this message
Sami Jaktholm (sjakthol) wrote :

Thank you for taking the time to report this bug and helping to make Ubuntu better. This particular bug has already been reported and is a duplicate of bug 874395, so it is being marked as such. Please look at the other bug report to see if there is any missing information that you can provide, or to see if there is a workaround for the bug. Additionally, any further discussion regarding the bug should occur in the other report. Feel free to continue to report any other bugs you may find.

To post a comment you must log in.
This report contains Public information  
Everyone can see this information.

Other bug subscribers

Remote bug watches

Bug watches keep track of this bug in other bug trackers.