ubuntu 14.04 undefined reference to `boost::system::generic_category()'

Bug #1404048 reported by thomasw on 2014-12-18
6
This bug affects 1 person
Affects Status Importance Assigned to Milestone
Blitzortung-Tracker
Critical
Andreas Würl

Bug Description

There is still a bug after installing (libboost-system):
http://packages.ubuntu.com/de/trusty/libboost-system1.54.0

Error in step dpkg-buildpackage:

bo-tracker.o: In function `__static_initialization_and_destruction_0':
/usr/include/boost/system/error_code.hpp:222: undefined reference to `boost::system::generic_category()'
/usr/include/boost/system/error_code.hpp:223: undefined reference to `boost::system::generic_category()'
/usr/include/boost/system/error_code.hpp:224: undefined reference to `boost::system::system_category()'
collect2: error: ld returned 1 exit status
make[4]: *** [bo-tracker] Fehler 1
make[4]: Verlasse Verzeichnis '/home/thomas/tracker/source'
make[3]: *** [all-recursive] Fehler 1
make[3]: Verlasse Verzeichnis '/home/thomas/tracker/source'
make[2]: *** [all-recursive] Fehler 1
make[2]: Verlasse Verzeichnis '/home/thomas/tracker'
make[1]: *** [all] Fehler 2
make[1]: Verlasse Verzeichnis '/home/thomas/tracker'
dh_auto_build: make -j1 returned exit code 2
make: *** [build] Fehler 2
dpkg-buildpackage: Fehler: Fehler-Exitstatus von debian/rules build war 2

Andreas Würl (awuerl) wrote :

The fix was committed after the project was migrated to github.

Please see https://github.com/wuan/bo-tracker for the recent changes.

Changed in blitzortung-tracker:
status: New → Fix Committed
importance: Undecided → Critical
assignee: nobody → Andreas Würl (awuerl)
To post a comment you must log in.
This report contains Public information  Edit
Everyone can see this information.

Other bug subscribers